Reaction Details
TargetRibosomal protein S6 kinase alpha-6
LigandBDBM50355495
Substrate/Competitorn/a
Meas. Tech.ChEMBL_774562 (CHEMBL1908779)
Kd>10000±n/a nM
Citation Davis, MIHunt, JPHerrgard, SCiceri, PWodicka, LMPallares, GHocker, MTreiber, DKZarrinkar, PP Comprehensive analysis of kinase inhibitor selectivity. Nat Biotechnol29:1046-51 (2011) 
 
Ribosomal protein S6 kinase alpha-6
Name:Ribosomal protein S6 kinase alpha-6
Type:Serine/threonine-protein kinase
Mol. Mass.:83868.06
Organism:Homo sapiens (Human)
Description:n/a
Residue:745
BDBM50355495
NameBDBM50355495
Synonyms:CHEMBL1908391
TypeSmall organic molecule
Emp. Form.C28H30N6OS
Mol. Mass.498.642
SMILESCN1CCN(Cc2ccc(cc2)C(=O)Nc2ccc(C)c(Nc3nc(cs3)-c3cccnc3)c2)CC1