Reaction Details
TargetInterleukin-1 receptor-associated kinase 3
LigandBDBM25117
Substrate/Competitorn/a
Meas. Tech.ChEMBL_774546 (CHEMBL1908763)
Kd>10000±n/a nM
Citation Davis, MIHunt, JPHerrgard, SCiceri, PWodicka, LMPallares, GHocker, MTreiber, DKZarrinkar, PP Comprehensive analysis of kinase inhibitor selectivity. Nat Biotechnol29:1046-51 (2011) 
 
Interleukin-1 receptor-associated kinase 3
Name:Interleukin-1 receptor-associated kinase 3
Type:PROTEIN
Mol. Mass.:67767.98
Organism:Homo sapiens (Human)
Description:EBI_101055
Residue:596
BDBM25117
NameBDBM25117
Synonyms:AG-013736 N-methyl-2-({3-[(E)-2-(pyridin-2-yl)ethenyl]-1H-indazol-6-yl}sulfanyl)benzamide US9205078, Axitinib | US9617222, Compound A
TypeSmall organic molecule
Emp. Form.C22H18N4OS
Mol. Mass.386.47
SMILESCNC(=O)c1ccccc1Sc1ccc2c(\C=C\c3ccccn3)n[nH]c2c1