Reaction Details
TargetProto-oncogene tyrosine-protein kinase receptor Ret
LigandBDBM50355497
Substrate/Competitorn/a
Meas. Tech.ChEMBL_774602 (CHEMBL1908819)
Kd>10000±n/a nM
Citation Davis, MIHunt, JPHerrgard, SCiceri, PWodicka, LMPallares, GHocker, MTreiber, DKZarrinkar, PP Comprehensive analysis of kinase inhibitor selectivity. Nat Biotechnol29:1046-51 (2011) 
 
Proto-oncogene tyrosine-protein kinase receptor Ret
Name:Proto-oncogene tyrosine-protein kinase receptor Ret
Type:Protein
Mol. Mass.:124318.29
Organism:Homo sapiens (Human)
Description:P07949
Residue:1114
BDBM50355497
NameBDBM50355497
Synonyms:AZD-6244 | CHEMBL1614701
TypeSmall organic molecule
Emp. Form.C17H15BrClFN4O3
Mol. Mass.457.681
SMILESCn1cnc2c(F)c(Nc3ccc(Br)cc3Cl)c(cc12)C(=O)NOCCO