Reaction Details
TargetRibosomal protein S6 kinase alpha-4
LigandBDBM50322823
Substrate/Competitorn/a
Meas. Tech.ChEMBL_774407 (CHEMBL1908624)
Kd>10000±n/a nM
Citation Davis, MIHunt, JPHerrgard, SCiceri, PWodicka, LMPallares, GHocker, MTreiber, DKZarrinkar, PP Comprehensive analysis of kinase inhibitor selectivity. Nat Biotechnol29:1046-51 (2011) 
 
Ribosomal protein S6 kinase alpha-4
Name:Ribosomal protein S6 kinase alpha-4
Type:Serine/threonine-protein kinase
Mol. Mass.:85620.38
Organism:Homo sapiens (Human)
Description:Recombinant MSK2 was phosphorylated by incubation with active p38alpha before assays.
Residue:772
BDBM50322823
NameBDBM50322823
Synonyms:(S)-N-(4-(3-chloro-4-fluorophenylamino)-7-(tetrahydrofuran-3-yloxy)quinazolin-6-yl)-4-(dimethylamino)but-2-enamide CHEMBL1173655 US10196365, Afatinib US9388170, Afatinib WO2022090481, Example afatinib
TypeSmall organic molecule
Emp. Form.C24H25ClFN5O3
Mol. Mass.485.938
SMILESCN(C)C\C=C\C(=O)Nc1cc2c(Nc3ccc(F)c(Cl)c3)ncnc2cc1O[C@H]1CCOC1