Reaction Details
TargetSerine/threonine-protein kinase Chk1
LigandBDBM50132260
Substrate/Competitorn/a
Meas. Tech.ChEMBL_774311 (CHEMBL1908528)
Kd>10000±n/a nM
Citation Davis, MIHunt, JPHerrgard, SCiceri, PWodicka, LMPallares, GHocker, MTreiber, DKZarrinkar, PP Comprehensive analysis of kinase inhibitor selectivity. Nat Biotechnol29:1046-51 (2011) 
 
Serine/threonine-protein kinase Chk1
Name:Serine/threonine-protein kinase Chk1
Type:Enzyme Catalytic Domain
Mol. Mass.:54443.02
Organism:Homo sapiens (Human)
Description:gi_166295192
Residue:476
BDBM50132260
NameBDBM50132260
Synonyms:2-(2-Chloro-4-iodo-phenylamino)-N-cyclopropylmethoxy-3,4-difluoro-benzamide CHEMBL105442 PD-18435 US8575391, 341
TypeSmall organic molecule
Emp. Form.C17H14ClF2IN2O2
Mol. Mass.478.66
SMILESFc1ccc(C(=O)NOCC2CC2)c(Nc2ccc(I)cc2Cl)c1F