Reaction Details
TargetHepatocyte growth factor receptor
LigandBDBM12621
Substrate/Competitorn/a
Meas. Tech.ChEMBL_774274 (CHEMBL1908491)
Kd>10000±n/a nM
Citation Davis, MIHunt, JPHerrgard, SCiceri, PWodicka, LMPallares, GHocker, MTreiber, DKZarrinkar, PP Comprehensive analysis of kinase inhibitor selectivity. Nat Biotechnol29:1046-51 (2011) 
 
Hepatocyte growth factor receptor
Name:Hepatocyte growth factor receptor
Type:Protein
Mol. Mass.:155559.73
Organism:Homo sapiens (Human)
Description:P08581
Residue:1390
BDBM12621
NameBDBM12621
Synonyms:2,4-Diamino-5-ketopyrimidine 39 R547 | [4-Amino-2-(1-methanesulfonylpiperidin-4-ylamino)pyrimidin-5-yl](2,3-difluoro-6-methoxyphenyl)methanone
TypeSmall organic molecule
Emp. Form.C18H21F2N5O4S
Mol. Mass.441.452
SMILESCOc1ccc(F)c(F)c1C(=O)c1cnc(NC2CCN(CC2)S(C)(=O)=O)nc1N