Reaction Details
TargetMitogen-activated protein kinase kinase kinase 4
LigandBDBM50355494
Substrate/Competitorn/a
Meas. Tech.ChEMBL_774507 (CHEMBL1908724)
Kd>10000±n/a nM
Citation Davis, MIHunt, JPHerrgard, SCiceri, PWodicka, LMPallares, GHocker, MTreiber, DKZarrinkar, PP Comprehensive analysis of kinase inhibitor selectivity. Nat Biotechnol29:1046-51 (2011) 
 
Mitogen-activated protein kinase kinase kinase 4
Name:Mitogen-activated protein kinase kinase kinase 4
Type:PROTEIN
Mol. Mass.:181676.15
Organism:Homo sapiens (Human)
Description:ChEMBL_774507
Residue:1608
BDBM50355494
NameBDBM50355494
Synonyms:CHEMBL1908396
TypeSmall organic molecule
Emp. Form.C24H24N4O5S
Mol. Mass.480.536
SMILESCOc1cc(Oc2ccnc3cc(OC)c(OC)cc23)ccc1NC(=O)NC(C)c1nccs1