Reaction Details
TargetMitogen-activated protein kinase 6
LigandBDBM50026612
Substrate/Competitorn/a
Meas. Tech.ChEMBL_774367 (CHEMBL1908584)
Kd>10000±n/a nM
Citation Davis, MIHunt, JPHerrgard, SCiceri, PWodicka, LMPallares, GHocker, MTreiber, DKZarrinkar, PP Comprehensive analysis of kinase inhibitor selectivity. Nat Biotechnol29:1046-51 (2011) 
 
Mitogen-activated protein kinase 6
Name:Mitogen-activated protein kinase 6
Type:PROTEIN
Mol. Mass.:82643.07
Organism:Homo sapiens (Human)
Description:ChEMBL_774367
Residue:721
BDBM50026612
NameBDBM50026612
Synonyms:BIBF-1120 US10981896, Compound Nintedanib US11208381, Nintedanib | Vargatef
TypeSmall organic molecule
Emp. Form.C31H33N5O4
Mol. Mass.539.6248
SMILESCOC(=O)c1ccc2\C(=C(\Nc3ccc(cc3)N(C)C(=O)CN3CCN(C)CC3)c3ccccc3)C(=O)Nc2c1