Reaction Details
TargetInterleukin-1 receptor-associated kinase 3
LigandBDBM25084
Substrate/Competitorn/a
Meas. Tech.ChEMBL_774546 (CHEMBL1908763)
Kd>10000±n/a nM
Citation Davis, MIHunt, JPHerrgard, SCiceri, PWodicka, LMPallares, GHocker, MTreiber, DKZarrinkar, PP Comprehensive analysis of kinase inhibitor selectivity. Nat Biotechnol29:1046-51 (2011) 
 
Interleukin-1 receptor-associated kinase 3
Name:Interleukin-1 receptor-associated kinase 3
Type:PROTEIN
Mol. Mass.:67767.98
Organism:Homo sapiens (Human)
Description:EBI_101055
Residue:596
BDBM25084
NameBDBM25084
Synonyms:3-[2,4-diamino-6-(3-hydroxyphenyl)pteridin-7-yl]phenol TG100-115
TypeSmall organic molecule
Emp. Form.C18H14N6O2
Mol. Mass.346.3428
SMILESNc1nc(N)c2nc(-c3cccc(O)c3)c(nc2n1)-c1cccc(O)c1