Reaction Details
TargetCalcium/calmodulin-dependent protein kinase type II subunit beta
LigandBDBM50355499
Substrate/Competitorn/a
Meas. Tech.ChEMBL_774307 (CHEMBL1908524)
Kd>10000±n/a nM
Citation Davis, MIHunt, JPHerrgard, SCiceri, PWodicka, LMPallares, GHocker, MTreiber, DKZarrinkar, PP Comprehensive analysis of kinase inhibitor selectivity. Nat Biotechnol29:1046-51 (2011) 
 
Calcium/calmodulin-dependent protein kinase type II subunit beta
Name:Calcium/calmodulin-dependent protein kinase type II subunit beta
Type:Enzyme Catalytic Domain
Mol. Mass.:72685.48
Organism:Homo sapiens (Human)
Description:gi_26051204
Residue:666
BDBM50355499
NameBDBM50355499
Synonyms:CHEMBL1908395 | CHEMBL1908842
TypeSmall organic molecule
Emp. Form.C26H32N6O2
Mol. Mass.460.5713
SMILESCN(C)CC(=O)N1CCC(CC1)c1ccc(NC(=O)c2ncc([nH]2)C#N)c(c1)C1=CCCCC1