Reaction Details
TargetTyrosine-protein kinase ABL1
LigandBDBM50355500
Substrate/Competitorn/a
Meas. Tech.ChEMBL_774465 (CHEMBL1908682)
Kd>10000±n/a nM
Citation Davis, MIHunt, JPHerrgard, SCiceri, PWodicka, LMPallares, GHocker, MTreiber, DKZarrinkar, PP Comprehensive analysis of kinase inhibitor selectivity. Nat Biotechnol29:1046-51 (2011) 
 
Tyrosine-protein kinase ABL1
Name:Tyrosine-protein kinase ABL1
Type:Enzyme
Mol. Mass.:122897.30
Organism:Homo sapiens (Human)
Description:P00519
Residue:1130
BDBM50355500
NameBDBM50355500
Synonyms:CHEMBL1908394 | US9695172, GSK461364
TypeSmall organic molecule
Emp. Form.C27H28F3N5O2S
Mol. Mass.543.604
SMILESC[C@@H](Oc1cc(sc1C(N)=O)-n1cnc2ccc(CN3CCN(C)CC3)cc12)c1ccccc1C(F)(F)F