Reaction Details
TargetSerine/threonine-protein kinase MRCK gamma
LigandBDBM5447
Substrate/Competitorn/a
Meas. Tech.ChEMBL_774587 (CHEMBL1908804)
Kd>10000±n/a nM
Citation Davis, MIHunt, JPHerrgard, SCiceri, PWodicka, LMPallares, GHocker, MTreiber, DKZarrinkar, PP Comprehensive analysis of kinase inhibitor selectivity. Nat Biotechnol29:1046-51 (2011) 
 
Serine/threonine-protein kinase MRCK gamma
Name:Serine/threonine-protein kinase MRCK gamma
Type:PROTEIN
Mol. Mass.:172450.18
Organism:Homo sapiens (Human)
Description:ChEMBL_774587
Residue:1551
BDBM5447
NameBDBM5447
Synonyms:CHEMBL939 Iressa N-(3-chloro-4-fluorophenyl)-7-methoxy-6-[3-(morpholin-4-yl)propoxy]quinazolin-4-amine US10507209, Compound Gefitinib US9730934, Gefitinib WO2022090481, Example gefitinib cid_123631
TypeSmall organic molecule
Emp. Form.C22H24ClFN4O3
Mol. Mass.446.902
SMILESCOc1cc2ncnc(Nc3ccc(F)c(Cl)c3)c2cc1OCCCN1CCOCC1