Reaction Details
TargetSerine/threonine-protein kinase MAK
LigandBDBM50326053
Substrate/Competitorn/a
Meas. Tech.ChEMBL_774505 (CHEMBL1908722)
Kd>10000±n/a nM
Citation Davis, MIHunt, JPHerrgard, SCiceri, PWodicka, LMPallares, GHocker, MTreiber, DKZarrinkar, PP Comprehensive analysis of kinase inhibitor selectivity. Nat Biotechnol29:1046-51 (2011) 
 
Serine/threonine-protein kinase MAK
Name:Serine/threonine-protein kinase MAK
Type:PROTEIN
Mol. Mass.:70616.26
Organism:Homo sapiens (Human)
Description:ChEMBL_774505
Residue:623
BDBM50326053
NameBDBM50326053
Synonyms:CHEMBL608533 | PKC-412
TypeSmall organic molecule
Emp. Form.C35H30N4O4
Mol. Mass.570.6371
SMILESCO[C@@H]1[C@@H](C[C@H]2O[C@]1(C)n1c3ccccc3c3c4CNC(=O)c4c4c5ccccc5n2c4c13)N(C)C(=O)c1ccccc1