Reaction Details
TargetProto-oncogene tyrosine-protein kinase receptor Ret
LigandBDBM15138
Substrate/Competitorn/a
Meas. Tech.ChEMBL_774603 (CHEMBL1908820)
Kd 1900±n/a nM
Citation Davis, MIHunt, JPHerrgard, SCiceri, PWodicka, LMPallares, GHocker, MTreiber, DKZarrinkar, PP Comprehensive analysis of kinase inhibitor selectivity. Nat Biotechnol29:1046-51 (2011) 
 
Proto-oncogene tyrosine-protein kinase receptor Ret
Name:Proto-oncogene tyrosine-protein kinase receptor Ret
Type:Protein
Mol. Mass.:124318.29
Organism:Homo sapiens (Human)
Description:P07949
Residue:1114
BDBM15138
NameBDBM15138
Synonyms:5-indazolyl pyridine 11g A-674563 indazole-pyridine, 7
TypeSmall organic molecule
Emp. Form.C22H22N4O
Mol. Mass.358.4363
SMILESCc1n[nH]c2ccc(cc12)-c1cncc(OC[C@@H](N)Cc2ccccc2)c1