Reaction Details
TargetInterleukin-1 receptor-associated kinase 3
LigandBDBM5447
Substrate/Competitorn/a
Meas. Tech.ChEMBL_774546 (CHEMBL1908763)
Kd 1500±n/a nM
Citation Davis, MIHunt, JPHerrgard, SCiceri, PWodicka, LMPallares, GHocker, MTreiber, DKZarrinkar, PP Comprehensive analysis of kinase inhibitor selectivity. Nat Biotechnol29:1046-51 (2011) 
 
Interleukin-1 receptor-associated kinase 3
Name:Interleukin-1 receptor-associated kinase 3
Type:PROTEIN
Mol. Mass.:67767.98
Organism:Homo sapiens (Human)
Description:EBI_101055
Residue:596
BDBM5447
NameBDBM5447
Synonyms:CHEMBL939 Iressa N-(3-chloro-4-fluorophenyl)-7-methoxy-6-[3-(morpholin-4-yl)propoxy]quinazolin-4-amine US10507209, Compound Gefitinib US9730934, Gefitinib WO2022090481, Example gefitinib cid_123631
TypeSmall organic molecule
Emp. Form.C22H24ClFN4O3
Mol. Mass.446.902
SMILESCOc1cc2ncnc(Nc3ccc(F)c(Cl)c3)c2cc1OCCCN1CCOCC1