Reaction Details
TargetMyosin-IIIb
LigandBDBM25617
Substrate/Competitorn/a
Meas. Tech.ChEMBL_774297 (CHEMBL1908514)
Kd>10000±n/a nM
Citation Davis, MIHunt, JPHerrgard, SCiceri, PWodicka, LMPallares, GHocker, MTreiber, DKZarrinkar, PP Comprehensive analysis of kinase inhibitor selectivity. Nat Biotechnol29:1046-51 (2011) 
 
Myosin-IIIb
Name:Myosin-IIIb
Type:PROTEIN
Mol. Mass.:151861.71
Organism:Homo sapiens (Human)
Description:ChEMBL_774297
Residue:1341
BDBM25617
NameBDBM25617
Synonyms:N-[3-({5-chloro-1H-pyrrolo[2,3-b]pyridin-3-yl}carbonyl)-2,4-difluorophenyl]propane-1-sulfonamide | PLX4720
TypeSmall organic molecule
Emp. Form.C17H14ClF2N3O3S
Mol. Mass.413.826
SMILESCCCS(=O)(=O)Nc1ccc(F)c(C(=O)c2c[nH]c3ncc(Cl)cc23)c1F