Reaction Details
TargetReceptor-type tyrosine-protein kinase FLT3
LigandBDBM50355504
Substrate/Competitorn/a
Meas. Tech.ChEMBL_774416 (CHEMBL1908633)
Kd 2±n/a nM
Citation Davis, MIHunt, JPHerrgard, SCiceri, PWodicka, LMPallares, GHocker, MTreiber, DKZarrinkar, PP Comprehensive analysis of kinase inhibitor selectivity. Nat Biotechnol29:1046-51 (2011) 
 
Receptor-type tyrosine-protein kinase FLT3
Name:Receptor-type tyrosine-protein kinase FLT3
Type:Enzyme
Mol. Mass.:112888.62
Organism:Homo sapiens (Human)
Description:P36888
Residue:993
BDBM50355504
NameBDBM50355504
Synonyms:CHEMBL1908393
TypeSmall organic molecule
Emp. Form.C34H36F2N4O6
Mol. Mass.634.6696
SMILESCOc1cc2c(Oc3ccc(NC(=O)C4(CC4)C(=O)NC4=CCC(F)C=C4)cc3F)ccnc2cc1OCCCN1CCOCC1