Reaction Details
TargetSerine/threonine-protein kinase 25
LigandBDBM60665
Substrate/Competitorn/a
Meas. Tech.ChEMBL_774539 (CHEMBL1908756)
Kd 9200±n/a nM
Citation Davis, MIHunt, JPHerrgard, SCiceri, PWodicka, LMPallares, GHocker, MTreiber, DKZarrinkar, PP Comprehensive analysis of kinase inhibitor selectivity. Nat Biotechnol29:1046-51 (2011) 
 
Serine/threonine-protein kinase 25
Name:Serine/threonine-protein kinase 25
Type:PROTEIN
Mol. Mass.:48113.10
Organism:Homo sapiens (Human)
Description:ChEMBL_586495
Residue:426
BDBM60665
NameBDBM60665
Synonyms:BDBM50249542 US9212178, R406
Typen/a
Emp. Form.C22H23FN6O5
Mol. Mass.470.4536
SMILESCOc1cc(Nc2ncc(F)c(Nc3ccc4OC(C)(C)C(=O)Nc4n3)n2)cc(OC)c1OC