Reaction Details
TargetMitogen-activated protein kinase kinase kinase 2
LigandBDBM60665
Substrate/Competitorn/a
Meas. Tech.ChEMBL_774542 (CHEMBL1908759)
Kd 94±n/a nM
Citation Davis, MIHunt, JPHerrgard, SCiceri, PWodicka, LMPallares, GHocker, MTreiber, DKZarrinkar, PP Comprehensive analysis of kinase inhibitor selectivity. Nat Biotechnol29:1046-51 (2011) 
 
Mitogen-activated protein kinase kinase kinase 2
Name:Mitogen-activated protein kinase kinase kinase 2
Type:PROTEIN
Mol. Mass.:69751.14
Organism:Homo sapiens (Human)
Description:ChEMBL_1473904
Residue:619
BDBM60665
NameBDBM60665
Synonyms:BDBM50249542 US9212178, R406
Typen/a
Emp. Form.C22H23FN6O5
Mol. Mass.470.4536
SMILESCOc1cc(Nc2ncc(F)c(Nc3ccc4OC(C)(C)C(=O)Nc4n3)n2)cc(OC)c1OC