Reaction Details
TargetSerine/threonine-protein kinase TAO2
LigandBDBM60665
Substrate/Competitorn/a
Meas. Tech.ChEMBL_774579 (CHEMBL1908796)
Kd 640±n/a nM
Citation Davis, MIHunt, JPHerrgard, SCiceri, PWodicka, LMPallares, GHocker, MTreiber, DKZarrinkar, PP Comprehensive analysis of kinase inhibitor selectivity. Nat Biotechnol29:1046-51 (2011) 
 
Serine/threonine-protein kinase TAO2
Name:Serine/threonine-protein kinase TAO2
Type:Enzyme
Mol. Mass.:138262.36
Organism:Homo sapiens (Human)
Description:Q9UL54
Residue:1235
BDBM60665
NameBDBM60665
Synonyms:BDBM50249542 US9212178, R406
Typen/a
Emp. Form.C22H23FN6O5
Mol. Mass.470.4536
SMILESCOc1cc(Nc2ncc(F)c(Nc3ccc4OC(C)(C)C(=O)Nc4n3)n2)cc(OC)c1OC