Reaction Details
TargetDual specificity protein kinase CLK4
LigandBDBM50332294
Substrate/Competitorn/a
Meas. Tech.ChEMBL_774605 (CHEMBL1908822)
Kd 2000±n/a nM
Citation Davis, MIHunt, JPHerrgard, SCiceri, PWodicka, LMPallares, GHocker, MTreiber, DKZarrinkar, PP Comprehensive analysis of kinase inhibitor selectivity. Nat Biotechnol29:1046-51 (2011) 
 
Dual specificity protein kinase CLK4
Name:Dual specificity protein kinase CLK4
Type:Serine/threonine-protein kinase
Mol. Mass.:57522.53
Organism:Homo sapiens (Human)
Description:gi_10190706
Residue:481
BDBM50332294
NameBDBM50332294
Synonyms:CHEMBL1287853 US10112907, Example 00018 US10766894, Compound TABLE 1.3 US11384069, Example T-5
TypeSmall organic molecule
Emp. Form.C27H36N6O3S
Mol. Mass.524.678
SMILESCc1cnc(Nc2ccc(OCCN3CCCC3)cc2)nc1Nc1cccc(c1)S(=O)(=O)NC(C)(C)C