Reaction Details
TargetTyrosine-protein kinase Yes
LigandBDBM50355496
Substrate/Competitorn/a
Meas. Tech.ChEMBL_774498 (CHEMBL1908715)
Kd 18±n/a nM
Citation Davis, MIHunt, JPHerrgard, SCiceri, PWodicka, LMPallares, GHocker, MTreiber, DKZarrinkar, PP Comprehensive analysis of kinase inhibitor selectivity. Nat Biotechnol29:1046-51 (2011) 
 
Tyrosine-protein kinase Yes
Name:Tyrosine-protein kinase Yes
Type:Protein
Mol. Mass.:60801.54
Organism:Homo sapiens (Human)
Description:P07947
Residue:543
BDBM50355496
NameBDBM50355496
Synonyms:CHEMBL1908397
TypeSmall organic molecule
Emp. Form.C20H20N4O
Mol. Mass.332.399
SMILESO=C(N1CCNCC1)c1ccc(\C=C\c2n[nH]c3ccccc23)cc1