Reaction Details
TargetSerine/threonine-protein kinase MAK
LigandBDBM50355496
Substrate/Competitorn/a
Meas. Tech.ChEMBL_774505 (CHEMBL1908722)
Kd>10000±n/a nM
Citation Davis, MIHunt, JPHerrgard, SCiceri, PWodicka, LMPallares, GHocker, MTreiber, DKZarrinkar, PP Comprehensive analysis of kinase inhibitor selectivity. Nat Biotechnol29:1046-51 (2011) 
 
Serine/threonine-protein kinase MAK
Name:Serine/threonine-protein kinase MAK
Type:PROTEIN
Mol. Mass.:70616.26
Organism:Homo sapiens (Human)
Description:ChEMBL_774505
Residue:623
BDBM50355496
NameBDBM50355496
Synonyms:CHEMBL1908397
TypeSmall organic molecule
Emp. Form.C20H20N4O
Mol. Mass.332.399
SMILESO=C(N1CCNCC1)c1ccc(\C=C\c2n[nH]c3ccccc23)cc1