Reaction Details
TargetReceptor tyrosine-protein kinase erbB-3
LigandBDBM4779
Substrate/Competitorn/a
Meas. Tech.ChEMBL_774331 (CHEMBL1908548)
Kd 210±n/a nM
Citation Davis, MIHunt, JPHerrgard, SCiceri, PWodicka, LMPallares, GHocker, MTreiber, DKZarrinkar, PP Comprehensive analysis of kinase inhibitor selectivity. Nat Biotechnol29:1046-51 (2011) 
 
Receptor tyrosine-protein kinase erbB-3
Name:Receptor tyrosine-protein kinase erbB-3
Type:PROTEIN
Mol. Mass.:148097.73
Organism:Homo sapiens (Human)
Description:ChEMBL_774331
Residue:1342
BDBM4779
NameBDBM4779
Synonyms:CHEMBL31965 CI-1033 N-{4-[(3-chloro-4-fluorophenyl)amino]-7-[3-(morpholin-4-yl)propoxy]quinazolin-6-yl}prop-2-enamide US10507209, Compound CI-1033 cid_156414
TypeSmall organic molecule
Emp. Form.C24H25ClFN5O3
Mol. Mass.485.938
SMILESFc1ccc(Nc2ncnc3cc(OCCCN4CCOCC4)c(NC(=O)C=C)cc23)cc1Cl