Reaction Details
TargetMitogen-activated protein kinase kinase kinase 6
LigandBDBM60665
Substrate/Competitorn/a
Meas. Tech.ChEMBL_774442 (CHEMBL1908659)
Kd>10000±n/a nM
Citation Davis, MIHunt, JPHerrgard, SCiceri, PWodicka, LMPallares, GHocker, MTreiber, DKZarrinkar, PP Comprehensive analysis of kinase inhibitor selectivity. Nat Biotechnol29:1046-51 (2011) 
 
Mitogen-activated protein kinase kinase kinase 6
Name:Mitogen-activated protein kinase kinase kinase 6
Type:PROTEIN
Mol. Mass.:142605.03
Organism:Homo sapiens (Human)
Description:ChEMBL_655684
Residue:1288
BDBM60665
NameBDBM60665
Synonyms:BDBM50249542 US9212178, R406
Typen/a
Emp. Form.C22H23FN6O5
Mol. Mass.470.4536
SMILESCOc1cc(Nc2ncc(F)c(Nc3ccc4OC(C)(C)C(=O)Nc4n3)n2)cc(OC)c1OC