Reaction Details
TargetSerine/threonine-protein kinase tousled-like 1
LigandBDBM50355495
Substrate/Competitorn/a
Meas. Tech.ChEMBL_774549 (CHEMBL1908766)
Kd>10000±n/a nM
Citation Davis, MIHunt, JPHerrgard, SCiceri, PWodicka, LMPallares, GHocker, MTreiber, DKZarrinkar, PP Comprehensive analysis of kinase inhibitor selectivity. Nat Biotechnol29:1046-51 (2011) 
 
Serine/threonine-protein kinase tousled-like 1
Name:Serine/threonine-protein kinase tousled-like 1
Type:Enzyme Catalytic Domain
Mol. Mass.:86722.30
Organism:Homo sapiens (Human)
Description:gi_33636698
Residue:766
BDBM50355495
NameBDBM50355495
Synonyms:CHEMBL1908391
TypeSmall organic molecule
Emp. Form.C28H30N6OS
Mol. Mass.498.642
SMILESCN1CCN(Cc2ccc(cc2)C(=O)Nc2ccc(C)c(Nc3nc(cs3)-c3cccnc3)c2)CC1