Reaction Details
TargetSerine/threonine-protein kinase TAO2
LigandBDBM50355495
Substrate/Competitorn/a
Meas. Tech.ChEMBL_774579 (CHEMBL1908796)
Kd>10000±n/a nM
Citation Davis, MIHunt, JPHerrgard, SCiceri, PWodicka, LMPallares, GHocker, MTreiber, DKZarrinkar, PP Comprehensive analysis of kinase inhibitor selectivity. Nat Biotechnol29:1046-51 (2011) 
 
Serine/threonine-protein kinase TAO2
Name:Serine/threonine-protein kinase TAO2
Type:Enzyme
Mol. Mass.:138262.36
Organism:Homo sapiens (Human)
Description:Q9UL54
Residue:1235
BDBM50355495
NameBDBM50355495
Synonyms:CHEMBL1908391
TypeSmall organic molecule
Emp. Form.C28H30N6OS
Mol. Mass.498.642
SMILESCN1CCN(Cc2ccc(cc2)C(=O)Nc2ccc(C)c(Nc3nc(cs3)-c3cccnc3)c2)CC1