Reaction Details
TargetSRSF protein kinase 1
LigandBDBM482158
Substrate/Competitorn/a
Meas. Tech.ChEMBL_774383 (CHEMBL1908600)
Kd 4800±n/a nM
Citation Davis, MIHunt, JPHerrgard, SCiceri, PWodicka, LMPallares, GHocker, MTreiber, DKZarrinkar, PP Comprehensive analysis of kinase inhibitor selectivity. Nat Biotechnol29:1046-51 (2011) 
 
SRSF protein kinase 1
Name:SRSF protein kinase 1
Type:Protein
Mol. Mass.:74318.38
Organism:Homo sapiens (Human)
Description:Q96SB4
Residue:655
BDBM482158
NameBDBM482158
Synonyms:BDBM50242742 | TAE684
Typen/a
Emp. Form.C30H40ClN7O3S
Mol. Mass.614.202
SMILESCOc1cc(ccc1Nc1ncc(Cl)c(Nc2ccccc2S(=O)(=O)C(C)C)n1)N1CCC(CC1)N1CCN(C)CC1