Reaction Details
TargetCasein kinase I isoform alpha
LigandBDBM12621
Substrate/Competitorn/a
Meas. Tech.ChEMBL_774326 (CHEMBL1908543)
Kd>10000±n/a nM
Citation Davis, MIHunt, JPHerrgard, SCiceri, PWodicka, LMPallares, GHocker, MTreiber, DKZarrinkar, PP Comprehensive analysis of kinase inhibitor selectivity. Nat Biotechnol29:1046-51 (2011) 
 
Casein kinase I isoform alpha
Name:Casein kinase I isoform alpha
Type:Serine/threonine-protein kinase
Mol. Mass.:38936.59
Organism:Homo sapiens (Human)
Description:P48729
Residue:337
BDBM12621
NameBDBM12621
Synonyms:2,4-Diamino-5-ketopyrimidine 39 R547 | [4-Amino-2-(1-methanesulfonylpiperidin-4-ylamino)pyrimidin-5-yl](2,3-difluoro-6-methoxyphenyl)methanone
TypeSmall organic molecule
Emp. Form.C18H21F2N5O4S
Mol. Mass.441.452
SMILESCOc1ccc(F)c(F)c1C(=O)c1cnc(NC2CCN(CC2)S(C)(=O)=O)nc1N