Reaction Details
TargetMitogen-activated protein kinase kinase kinase 10
LigandBDBM12621
Substrate/Competitorn/a
Meas. Tech.ChEMBL_774347 (CHEMBL1908564)
Kd>10000±n/a nM
Citation Davis, MIHunt, JPHerrgard, SCiceri, PWodicka, LMPallares, GHocker, MTreiber, DKZarrinkar, PP Comprehensive analysis of kinase inhibitor selectivity. Nat Biotechnol29:1046-51 (2011) 
 
Mitogen-activated protein kinase kinase kinase 10
Name:Mitogen-activated protein kinase kinase kinase 10
Type:PROTEIN
Mol. Mass.:103699.30
Organism:Homo sapiens (Human)
Description:ChEMBL_1460564
Residue:954
BDBM12621
NameBDBM12621
Synonyms:2,4-Diamino-5-ketopyrimidine 39 R547 | [4-Amino-2-(1-methanesulfonylpiperidin-4-ylamino)pyrimidin-5-yl](2,3-difluoro-6-methoxyphenyl)methanone
TypeSmall organic molecule
Emp. Form.C18H21F2N5O4S
Mol. Mass.441.452
SMILESCOc1ccc(F)c(F)c1C(=O)c1cnc(NC2CCN(CC2)S(C)(=O)=O)nc1N