Reaction Details
TargetCyclin-dependent kinase-like 5
LigandBDBM25919
Substrate/Competitorn/a
Meas. Tech.ChEMBL_774385 (CHEMBL1908602)
Kd>10000±n/a nM
Citation Davis, MIHunt, JPHerrgard, SCiceri, PWodicka, LMPallares, GHocker, MTreiber, DKZarrinkar, PP Comprehensive analysis of kinase inhibitor selectivity. Nat Biotechnol29:1046-51 (2011) 
 
Cyclin-dependent kinase-like 5
Name:Cyclin-dependent kinase-like 5
Type:PROTEIN
Mol. Mass.:115595.39
Organism:Homo sapiens (Human)
Description:ChEMBL_655722
Residue:1030
BDBM25919
NameBDBM25919
Synonyms:BMS-345541 CHEMBL471496 | N-(2-aminoethyl)-3,12-dimethyl-2,5,8-triazatricyclo[7.4.0.0^{2,6}]trideca-1(13),3,5,7,9,11-hexaen-7-amine
TypeSmall organic molecule
Emp. Form.C14H17N5
Mol. Mass.255.3183
SMILESCc1cnc2c(NCCN)nc3ccc(C)cc3n12