Reaction Details
TargetSerine/threonine-protein kinase BRSK2
LigandBDBM50132260
Substrate/Competitorn/a
Meas. Tech.ChEMBL_774409 (CHEMBL1908626)
Kd>10000±n/a nM
Citation Davis, MIHunt, JPHerrgard, SCiceri, PWodicka, LMPallares, GHocker, MTreiber, DKZarrinkar, PP Comprehensive analysis of kinase inhibitor selectivity. Nat Biotechnol29:1046-51 (2011) 
 
Serine/threonine-protein kinase BRSK2
Name:Serine/threonine-protein kinase BRSK2
Type:PROTEIN
Mol. Mass.:81657.07
Organism:Homo sapiens (Human)
Description:ChEMBL_586949
Residue:736
BDBM50132260
NameBDBM50132260
Synonyms:2-(2-Chloro-4-iodo-phenylamino)-N-cyclopropylmethoxy-3,4-difluoro-benzamide CHEMBL105442 PD-18435 US8575391, 341
TypeSmall organic molecule
Emp. Form.C17H14ClF2IN2O2
Mol. Mass.478.66
SMILESFc1ccc(C(=O)NOCC2CC2)c(Nc2ccc(I)cc2Cl)c1F