Reaction Details
TargetPhosphatidylinositol 4-phosphate 5-kinase type-1 alpha
LigandBDBM15138
Substrate/Competitorn/a
Meas. Tech.ChEMBL_774304 (CHEMBL1908521)
Kd 250±n/a nM
Citation Davis, MIHunt, JPHerrgard, SCiceri, PWodicka, LMPallares, GHocker, MTreiber, DKZarrinkar, PP Comprehensive analysis of kinase inhibitor selectivity. Nat Biotechnol29:1046-51 (2011) 
 
Phosphatidylinositol 4-phosphate 5-kinase type-1 alpha
Name:Phosphatidylinositol 4-phosphate 5-kinase type-1 alpha
Type:PROTEIN
Mol. Mass.:62644.19
Organism:Homo sapiens (Human)
Description:ChEMBL_774304
Residue:562
BDBM15138
NameBDBM15138
Synonyms:5-indazolyl pyridine 11g A-674563 indazole-pyridine, 7
TypeSmall organic molecule
Emp. Form.C22H22N4O
Mol. Mass.358.4363
SMILESCc1n[nH]c2ccc(cc12)-c1cncc(OC[C@@H](N)Cc2ccccc2)c1