Reaction Details
TargetPeripheral plasma membrane protein CASK
LigandBDBM60589
Substrate/Competitorn/a
Meas. Tech.ChEMBL_774229 (CHEMBL1908446)
Kd>10000±n/a nM
Citation Davis, MIHunt, JPHerrgard, SCiceri, PWodicka, LMPallares, GHocker, MTreiber, DKZarrinkar, PP Comprehensive analysis of kinase inhibitor selectivity. Nat Biotechnol29:1046-51 (2011) 
 
Peripheral plasma membrane protein CASK
Name:Peripheral plasma membrane protein CASK
Type:PROTEIN
Mol. Mass.:105119.01
Organism:Homo sapiens (Human)
Description:ChEMBL_774229
Residue:926
BDBM60589
NameBDBM60589
Synonyms:6-{[6-(1-methyl-1H-pyrazol-4-yl)-[1,2,4]triazolo[4,3-b]pyridazin-3-yl]sulfanyl}quinoline (4) | BDBM50355498
Typen/a
Emp. Form.C18H13N7S
Mol. Mass.359.408
SMILESCn1cc(cn1)-c1ccc2nnc(Sc3ccc4ncccc4c3)n2n1