Reaction Details
TargetMitogen-activated protein kinase kinase kinase 2
LigandBDBM31093
Substrate/Competitorn/a
Meas. Tech.ChEMBL_774542 (CHEMBL1908759)
Kd>10000±n/a nM
Citation Davis, MIHunt, JPHerrgard, SCiceri, PWodicka, LMPallares, GHocker, MTreiber, DKZarrinkar, PP Comprehensive analysis of kinase inhibitor selectivity. Nat Biotechnol29:1046-51 (2011) 
 
Mitogen-activated protein kinase kinase kinase 2
Name:Mitogen-activated protein kinase kinase kinase 2
Type:PROTEIN
Mol. Mass.:69751.14
Organism:Homo sapiens (Human)
Description:ChEMBL_1473904
Residue:619
BDBM31093
NameBDBM31093
Synonyms:4-[[7-[2,6-bis(fluoranyl)phenyl]-9-chloranyl-5H-pyrimido[5,4-d][2]benzazepin-2-yl]amino]benzoic acid BDBM31832 MLN-8054 | cid_11712649
TypeSmall organic molecule
Emp. Form.C25H15ClF2N4O2
Mol. Mass.476.862
SMILESOC(=O)c1ccc(Nc2ncc3CN=C(c4cc(Cl)ccc4-c3n2)c2c(F)cccc2F)cc1