Reaction Details
TargetMegakaryocyte-associated tyrosine-protein kinase
LigandBDBM31095
Substrate/Competitorn/a
Meas. Tech.ChEMBL_774344 (CHEMBL1908561)
Kd 6200±n/a nM
Citation Davis, MIHunt, JPHerrgard, SCiceri, PWodicka, LMPallares, GHocker, MTreiber, DKZarrinkar, PP Comprehensive analysis of kinase inhibitor selectivity. Nat Biotechnol29:1046-51 (2011) 
 
Megakaryocyte-associated tyrosine-protein kinase
Name:Megakaryocyte-associated tyrosine-protein kinase
Type:PROTEIN
Mol. Mass.:56488.45
Organism:Homo sapiens (Human)
Description:ChEMBL_774344
Residue:507
BDBM31095
NameBDBM31095
Synonyms:5-[(Z)-(5-fluoranyl-2-oxidanylidene-1H-indol-3-ylidene)methyl]-2,4-dimethyl-N-[(2S)-3-morpholin-4-yl-2-oxidanyl-propyl]-1H-pyrrole-3-carboxamide 5-[(Z)-(5-fluoro-2-oxo-1H-indol-3-ylidene)methyl]-N-[(2S)-2-hydroxy-3-(4-morpholinyl)propyl]-2,4-dimethyl-1H-pyrrole-3-carboxamide SU-14813 | cid_10138259
TypeSmall organic molecule
Emp. Form.C23H27FN4O4
Mol. Mass.442.4833
SMILESCc1[nH]c(\C=C2/C(=O)Nc3ccc(F)cc23)c(C)c1C(=O)NC[C@H](O)CN1CCOCC1