Reaction Details
TargetCasein kinase I isoform alpha-like
LigandBDBM50355499
Substrate/Competitorn/a
Meas. Tech.ChEMBL_774203 (CHEMBL1908420)
Kd>10000±n/a nM
Citation Davis, MIHunt, JPHerrgard, SCiceri, PWodicka, LMPallares, GHocker, MTreiber, DKZarrinkar, PP Comprehensive analysis of kinase inhibitor selectivity. Nat Biotechnol29:1046-51 (2011) 
 
Casein kinase I isoform alpha-like
Name:Casein kinase I isoform alpha-like
Type:PROTEIN
Mol. Mass.:39105.63
Organism:Homo sapiens (Human)
Description:ChEMBL_586447
Residue:337
BDBM50355499
NameBDBM50355499
Synonyms:CHEMBL1908395 | CHEMBL1908842
TypeSmall organic molecule
Emp. Form.C26H32N6O2
Mol. Mass.460.5713
SMILESCN(C)CC(=O)N1CCC(CC1)c1ccc(NC(=O)c2ncc([nH]2)C#N)c(c1)C1=CCCCC1