Reaction Details
TargetPeripheral plasma membrane protein CASK
LigandBDBM50355497
Substrate/Competitorn/a
Meas. Tech.ChEMBL_774229 (CHEMBL1908446)
Kd>10000±n/a nM
Citation Davis, MIHunt, JPHerrgard, SCiceri, PWodicka, LMPallares, GHocker, MTreiber, DKZarrinkar, PP Comprehensive analysis of kinase inhibitor selectivity. Nat Biotechnol29:1046-51 (2011) 
 
Peripheral plasma membrane protein CASK
Name:Peripheral plasma membrane protein CASK
Type:PROTEIN
Mol. Mass.:105119.01
Organism:Homo sapiens (Human)
Description:ChEMBL_774229
Residue:926
BDBM50355497
NameBDBM50355497
Synonyms:AZD-6244 | CHEMBL1614701
TypeSmall organic molecule
Emp. Form.C17H15BrClFN4O3
Mol. Mass.457.681
SMILESCn1cnc2c(F)c(Nc3ccc(Br)cc3Cl)c(cc12)C(=O)NOCCO