Reaction Details
TargetSerine/threonine-protein kinase MRCK beta
LigandBDBM25628
Substrate/Competitorn/a
Meas. Tech.ChEMBL_774511 (CHEMBL1908728)
Kd>10000±n/a nM
Citation Davis, MIHunt, JPHerrgard, SCiceri, PWodicka, LMPallares, GHocker, MTreiber, DKZarrinkar, PP Comprehensive analysis of kinase inhibitor selectivity. Nat Biotechnol29:1046-51 (2011) 
 
Serine/threonine-protein kinase MRCK beta
Name:Serine/threonine-protein kinase MRCK beta
Type:Protien
Mol. Mass.:194307.09
Organism:Homo sapiens (Human)
Description:Q9Y5S2
Residue:1711
BDBM25628
NameBDBM25628
Synonyms:2-{4-[(1Z)-1-(hydroxyimino)-2,3-dihydro-1H-inden-5-yl]-3-(pyridin-4-yl)-1H-pyrazol-1-yl}ethan-1-ol CHEMBL525191 | GDC-0879
TypeSmall organic molecule
Emp. Form.C19H18N4O2
Mol. Mass.334.3718
SMILESOCCn1cc(c(n1)-c1ccncc1)-c1ccc2C(CCc2c1)N=O