Reaction Details
TargetTyrosine-protein kinase Srms
LigandBDBM26300
Substrate/Competitorn/a
Meas. Tech.ChEMBL_774190 (CHEMBL1908407)
Kd 7900±n/a nM
Citation Davis, MIHunt, JPHerrgard, SCiceri, PWodicka, LMPallares, GHocker, MTreiber, DKZarrinkar, PP Comprehensive analysis of kinase inhibitor selectivity. Nat Biotechnol29:1046-51 (2011) 
 
Tyrosine-protein kinase Srms
Name:Tyrosine-protein kinase Srms
Type:Enzyme Catalytic Domain
Mol. Mass.:54517.24
Organism:Homo sapiens (Human)
Description:gi_18250298
Residue:488
BDBM26300
NameBDBM26300
Synonyms:2-{3-[(7-{3-[ethyl(2-hydroxyethyl)amino]propoxy}quinazolin-4-yl)amino]-1H-pyrazol-5-yl}-N-(3-fluorophenyl)acetamide cid_16007391 | pyrazoloquinazoline deriv., 34
TypeSmall organic molecule
Emp. Form.C26H30FN7O3
Mol. Mass.507.5599
SMILESCCN(CCO)CCCOc1ccc2c(Nc3cc(CC(=O)Nc4cccc(F)c4)n[nH]3)ncnc2c1