Reaction Details
TargetMitogen-activated protein kinase 15
LigandBDBM50355504
Substrate/Competitorn/a
Meas. Tech.ChEMBL_774195 (CHEMBL1908412)
Kd 73±n/a nM
Citation Davis, MIHunt, JPHerrgard, SCiceri, PWodicka, LMPallares, GHocker, MTreiber, DKZarrinkar, PP Comprehensive analysis of kinase inhibitor selectivity. Nat Biotechnol29:1046-51 (2011) 
 
Mitogen-activated protein kinase 15
Name:Mitogen-activated protein kinase 15
Type:Serine/threonine-protein kinase
Mol. Mass.:59850.14
Organism:Homo sapiens (Human)
Description:gi_95147356
Residue:544
BDBM50355504
NameBDBM50355504
Synonyms:CHEMBL1908393
TypeSmall organic molecule
Emp. Form.C34H36F2N4O6
Mol. Mass.634.6696
SMILESCOc1cc2c(Oc3ccc(NC(=O)C4(CC4)C(=O)NC4=CCC(F)C=C4)cc3F)ccnc2cc1OCCCN1CCOCC1