Reaction Details
TargetMitogen-activated protein kinase kinase kinase 13
LigandBDBM482158
Substrate/Competitorn/a
Meas. Tech.ChEMBL_774445 (CHEMBL1908662)
Kd 57±n/a nM
Citation Davis, MIHunt, JPHerrgard, SCiceri, PWodicka, LMPallares, GHocker, MTreiber, DKZarrinkar, PP Comprehensive analysis of kinase inhibitor selectivity. Nat Biotechnol29:1046-51 (2011) 
 
Mitogen-activated protein kinase kinase kinase 13
Name:Mitogen-activated protein kinase kinase kinase 13
Type:PROTEIN
Mol. Mass.:108293.85
Organism:Homo sapiens (Human)
Description:ChEMBL_774445
Residue:966
BDBM482158
NameBDBM482158
Synonyms:BDBM50242742 | TAE684
Typen/a
Emp. Form.C30H40ClN7O3S
Mol. Mass.614.202
SMILESCOc1cc(ccc1Nc1ncc(Cl)c(Nc2ccccc2S(=O)(=O)C(C)C)n1)N1CCC(CC1)N1CCN(C)CC1