Reaction Details
TargetTyrosine-protein kinase Srms
LigandBDBM50309910
Substrate/Competitorn/a
Meas. Tech.ChEMBL_774190 (CHEMBL1908407)
Kd>10000±n/a nM
Citation Davis, MIHunt, JPHerrgard, SCiceri, PWodicka, LMPallares, GHocker, MTreiber, DKZarrinkar, PP Comprehensive analysis of kinase inhibitor selectivity. Nat Biotechnol29:1046-51 (2011) 
 
Tyrosine-protein kinase Srms
Name:Tyrosine-protein kinase Srms
Type:Enzyme Catalytic Domain
Mol. Mass.:54517.24
Organism:Homo sapiens (Human)
Description:gi_18250298
Residue:488
BDBM50309910
NameBDBM50309910
Synonyms:CHEMBL608154 N-(6-chloro-7-methoxy-9H-pyrido[3,4-b]indol-8-yl)-2-methylnicotinamide
TypeSmall organic molecule
Emp. Form.C19H15ClN4O2
Mol. Mass.366.801
SMILESCOc1c(Cl)cc2c3ccncc3[nH]c2c1NC(=O)c1cccnc1C