Reaction Details
TargetSerine/threonine-protein kinase 32A
LigandBDBM50355501
Substrate/Competitorn/a
Meas. Tech.ChEMBL_774301 (CHEMBL1908518)
Kd>10000±n/a nM
Citation Davis, MIHunt, JPHerrgard, SCiceri, PWodicka, LMPallares, GHocker, MTreiber, DKZarrinkar, PP Comprehensive analysis of kinase inhibitor selectivity. Nat Biotechnol29:1046-51 (2011) 
 
Serine/threonine-protein kinase 32A
Name:Serine/threonine-protein kinase 32A
Type:PROTEIN
Mol. Mass.:46373.69
Organism:Homo sapiens (Human)
Description:ChEMBL_774301
Residue:396
BDBM50355501
NameBDBM50355501
Synonyms:INCB-018424 RUXOLITINIB PHOSPHATE US10766894, Compound TABLE 1.1 US11203595, TABLE 1.1 | US11279703, TABLE 6.147
TypeSmall organic molecule
Emp. Form.C17H18N6
Mol. Mass.306.365
SMILESN#CC[C@H](C1CCCC1)n1cc(cn1)-c1ncnc2[nH]ccc12