Reaction Details
TargetCyclin-dependent kinase-like 1 [2-358]
LigandBDBM25013
Substrate/Competitorn/a
Meas. Tech.ChEMBL_774421 (CHEMBL1908638)
Kd>10000±n/a nM
Citation Davis, MIHunt, JPHerrgard, SCiceri, PWodicka, LMPallares, GHocker, MTreiber, DKZarrinkar, PP Comprehensive analysis of kinase inhibitor selectivity. Nat Biotechnol29:1046-51 (2011) 
 
Cyclin-dependent kinase-like 1 [2-358]
Name:Cyclin-dependent kinase-like 1 [2-358]
Type:PROTEIN
Mol. Mass.:41689.97
Organism:Homo sapiens (Human)
Description:ChEMBL_774421
Residue:357
BDBM25013
NameBDBM25013
Synonyms:4-[2-(4-amino-1,2,5-oxadiazol-3-yl)-1-ethyl-7-[(3S)-piperidin-3-ylmethoxy]-1H-imidazo[4,5-c]pyridin-4-yl]-2-methylbut-3-yn-2-ol GSK690693 | US10550114, Compound GSK690693
TypeSmall organic molecule
Emp. Form.C21H27N7O3
Mol. Mass.425.4842
SMILESCCn1c(nc2c(ncc(OC[C@H]3CCCNC3)c12)C#CC(C)(C)O)-c1nonc1N