Reaction Details
TargetSerine/threonine-protein kinase ICK
LigandBDBM15244
Substrate/Competitorn/a
Meas. Tech.ChEMBL_774570 (CHEMBL1908787)
Kd>10000±n/a nM
Citation Davis, MIHunt, JPHerrgard, SCiceri, PWodicka, LMPallares, GHocker, MTreiber, DKZarrinkar, PP Comprehensive analysis of kinase inhibitor selectivity. Nat Biotechnol29:1046-51 (2011) 
 
Serine/threonine-protein kinase ICK
Name:Serine/threonine-protein kinase ICK
Type:PROTEIN
Mol. Mass.:71470.23
Organism:Homo sapiens (Human)
Description:ChEMBL_774570
Residue:632
BDBM15244
NameBDBM15244
Synonyms:5-(2,6-dichlorophenyl)-2-(2,4-difluorophenyl)sulfanylpyrimido[1,6-b]pyridazin-6-one 5-(2,6-dichlorophenyl)-2-[(2,4-difluorophenyl)thio]-6-pyrimido[1,6-b]pyridazinone 5-(2,6-dichlorophenyl)-9-(2,4-difluorophenyl)sulfanyl-1,3,10-triazabicyclo[4.4.0]deca-2,5,7,9-tetraen-4-one VX-745 cid_3038525
TypeSmall organic molecule
Emp. Form.C19H9Cl2F2N3OS
Mol. Mass.436.262
SMILESFc1ccc(Sc2ccc3c(-c4c(Cl)cccc4Cl)c(=O)ncn3n2)c(F)c1