Reaction Details
TargetSerine/threonine-protein kinase 38-like
LigandBDBM5655
Substrate/Competitorn/a
Meas. Tech.ChEMBL_774572 (CHEMBL1908789)
Kd>10000±n/a nM
Citation Davis, MIHunt, JPHerrgard, SCiceri, PWodicka, LMPallares, GHocker, MTreiber, DKZarrinkar, PP Comprehensive analysis of kinase inhibitor selectivity. Nat Biotechnol29:1046-51 (2011) 
 
Serine/threonine-protein kinase 38-like
Name:Serine/threonine-protein kinase 38-like
Type:PROTEIN
Mol. Mass.:54004.24
Organism:Homo sapiens (Human)
Description:ChEMBL_587191
Residue:464
BDBM5655
NameBDBM5655
Synonyms:2-(2-chlorophenyl)-5,7-dihydroxy-8-[(3S,4R)-3-hydroxy-1-methylpiperidin-4-yl]-4H-chromen-4-one Flavopiridol US9617225, Flavopiridol
TypeSmall organic molecule
Emp. Form.C21H20ClNO5
Mol. Mass.401.84
SMILESCN1CC[C@@H]([C@H](O)C1)c1c(O)cc(O)c2c1oc(cc2=O)-c1ccccc1Cl