Reaction Details
TargetCyclin-dependent kinase 18 [3-474]
LigandBDBM50355500
Substrate/Competitorn/a
Meas. Tech.ChEMBL_774354 (CHEMBL1908571)
Kd>10000±n/a nM
Citation Davis, MIHunt, JPHerrgard, SCiceri, PWodicka, LMPallares, GHocker, MTreiber, DKZarrinkar, PP Comprehensive analysis of kinase inhibitor selectivity. Nat Biotechnol29:1046-51 (2011) 
 
Cyclin-dependent kinase 18 [3-474]
Name:Cyclin-dependent kinase 18 [3-474]
Type:PROTEIN
Mol. Mass.:54193.55
Organism:Homo sapiens (Human)
Description:ChEMBL_774354
Residue:472
BDBM50355500
NameBDBM50355500
Synonyms:CHEMBL1908394 | US9695172, GSK461364
TypeSmall organic molecule
Emp. Form.C27H28F3N5O2S
Mol. Mass.543.604
SMILESC[C@@H](Oc1cc(sc1C(N)=O)-n1cnc2ccc(CN3CCN(C)CC3)cc12)c1ccccc1C(F)(F)F