Reaction Details
TargetCasein kinase I isoform gamma-3
LigandBDBM50161957
Substrate/Competitorn/a
Meas. Tech.ChEMBL_774429 (CHEMBL1908646)
Kd 7800±n/a nM
Citation Davis, MIHunt, JPHerrgard, SCiceri, PWodicka, LMPallares, GHocker, MTreiber, DKZarrinkar, PP Comprehensive analysis of kinase inhibitor selectivity. Nat Biotechnol29:1046-51 (2011) 
 
Casein kinase I isoform gamma-3
Name:Casein kinase I isoform gamma-3
Type:PROTEIN
Mol. Mass.:51411.12
Organism:Homo sapiens (Human)
Description:ChEMBL_1440403
Residue:447
BDBM50161957
NameBDBM50161957
Synonyms:4-Dimethylamino-but-2-enoic acid {4-[3-chloro-4-(pyridin-2-ylmethoxy)-phenylamino]-3-cyano-7-ethoxy-quinolin-6-yl}-amide HKI-272 N-(4-(3-chloro-4-(pyridin-2-ylmethoxy)phenylamino)-3-cyano-7-ethoxyquinolin-6-yl)-4-(dimethylamino)butanamide US10822334, Compound Neratinib | US20230382923, Compound Neratinib
TypeSmall organic molecule
Emp. Form.C30H29ClN6O3
Mol. Mass.557.043
SMILESCCOc1cc2ncc(C#N)c(Nc3ccc(OCc4ccccn4)c(Cl)c3)c2cc1NC(=O)\C=C\CN(C)C