Reaction Details
TargetMitogen-activated protein kinase 4
LigandBDBM50161957
Substrate/Competitorn/a
Meas. Tech.ChEMBL_774366 (CHEMBL1908583)
Kd>10000±n/a nM
Citation Davis, MIHunt, JPHerrgard, SCiceri, PWodicka, LMPallares, GHocker, MTreiber, DKZarrinkar, PP Comprehensive analysis of kinase inhibitor selectivity. Nat Biotechnol29:1046-51 (2011) 
 
Mitogen-activated protein kinase 4
Name:Mitogen-activated protein kinase 4
Type:Enzyme Catalytic Domain
Mol. Mass.:65906.37
Organism:Homo sapiens (Human)
Description:gi_89276769
Residue:587
BDBM50161957
NameBDBM50161957
Synonyms:4-Dimethylamino-but-2-enoic acid {4-[3-chloro-4-(pyridin-2-ylmethoxy)-phenylamino]-3-cyano-7-ethoxy-quinolin-6-yl}-amide HKI-272 N-(4-(3-chloro-4-(pyridin-2-ylmethoxy)phenylamino)-3-cyano-7-ethoxyquinolin-6-yl)-4-(dimethylamino)butanamide US10822334, Compound Neratinib | US20230382923, Compound Neratinib
TypeSmall organic molecule
Emp. Form.C30H29ClN6O3
Mol. Mass.557.043
SMILESCCOc1cc2ncc(C#N)c(Nc3ccc(OCc4ccccn4)c(Cl)c3)c2cc1NC(=O)\C=C\CN(C)C